{"text_format":"1","workbook":"xlsx","n_sheets":5,"sheets":["🏠","Resumo","Graph Data","Tags","Transações"],"not_rendered":{"charts":2,"images":4,"macros":1,"external_links":0,"defined_names":3,"comments":0,"pivot_tables":0},"unopened":[],"bounds":{"document_bytes":16777216,"sheet_cells":100000,"rows_first":2000,"rows_last":500,"rows_between":2000,"halvings":0,"cell_chars":16384,"cell_head_chars":4096},"cells_cut":0,"cells_raw":0,"read":"whole","date_system":"1900"}

{"sheet":"🏠","index":0,"n_rows":11,"n_cols":3,"rows_kept":11,"cut":false,"hidden":false,"merged":[]}
[null,null,"Planilha de Gastos"]
[]
[null,"1.","Comece registrando sua transação de entrada ou saída"]
[]
[null,"2.","Você pode cadastrar as categorias mais frequentes de transações. Já colocamos as mais comuns como \"salário\" e \"mercado\" por exemplo! :)"]
[]
[null,"3.","Você pode consultar e editar todas as transações!"]
[]
[null,"4.","A qualquer momento você pode clicar no botão para desfazer a transação mais recente ou reiniciar a planilha (cuidado para não perder seus dados!)"]
[]
[null,"5.","A planilha roda com macros, não se esqueça de habilitá-las para poder utilizá-la corretamente! Basta clicar no botão \"Habilitar Edição\" e logo em seguida no botão \"Habilitar Conteúdo\""]

{"sheet":"Resumo","index":1,"n_rows":8,"n_cols":7,"rows_kept":8,"cut":false,"hidden":false,"merged":[[4,8,4,9]]}
[]
[null,null,null,null,null,"Ano ",2022]
[null,null,null,null,null,"Mês","Fevereiro"]
[null,null,null,null,null,"Resumo","Valor (R$)"]
[null,null,null,null,null,"🟢  Entrou",{"$f":"'Graph Data'!G3","v":2500}]
[null,null,null,null,null,"🔴  Saiu",{"$f":"'Graph Data'!G4","v":1600.5}]
[null,null,null,null,null,"Sobrou",{"$f":"'Graph Data'!G5","v":899.5}]
[null,null,null,null,null,"Acumulado",{"$f":"SUM(Transações!E2:E1048576)-SUM(Transações!D2:D1048576)","v":7948.75}]

{"sheet":"Graph Data","index":2,"n_rows":1000,"n_cols":22,"rows_kept":1000,"cut":false,"hidden":true,"merged":[[1,5,1,6],[1,0,1,1]]}
["Mês",{"$f":"MATCH(Resumo!$G$3,'Graph Data'!C3:C14,0)","v":2},null,null,null,null,null,null,{"$f":"D2","v":"INICIO"},null,{"$f":"DATE(J3,1,1)","v":"2022-01-01"},{"$f":"DATE($J$3,2,1)","v":"2022-02-01"},{"$f":"DATE($J$3,3,1)","v":"2022-03-01"},{"$f":"DATE($J$3,4,1)","v":"2022-04-01"},{"$f":"DATE($J$3,5,1)","v":"2022-05-01"},{"$f":"DATE($J$3,6,1)","v":"2022-06-01"},{"$f":"DATE($J$3,7,1)","v":"2022-07-01"},{"$f":"DATE($J$3,8,1)","v":"2022-08-01"},{"$f":"DATE($J$3,9,1)","v":"2022-09-01"},{"$f":"DATE($J$3,10,1)","v":"2022-10-01"},{"$f":"DATE($J$3,11,1)","v":"2022-11-01"},{"$f":"DATE($J$3,12,1)","v":"2022-12-01"}]
["Graph Data",null,"Mês","INICIO",{"$f":"DATE(Resumo!G2,'Graph Data'!B1,1)","v":"2022-02-01"},"Table Data",null,"Ano",{"$f":"D3","v":"TÉRMINO"},null,{"$f":"EOMONTH(K1,0)","v":"2022-01-31"},{"$f":"EOMONTH(L1,0)","v":"2022-02-28"},"2022-03-31","2022-04-30","2022-05-31","2022-06-30","2022-07-31","2022-08-31","2022-09-30","2022-10-31","2022-11-30","2022-12-31"]
["Mercado",{"$f":"IF(SUMIFS(Transações!D:D,Transações!A:A,\">=\"&'Graph Data'!$E$2,Transações!A:A,\"<=\"&'Graph Data'!$E$3,Transações!C:C,'Graph Data'!A3)=0,NA(),SUMIFS(Transações!D:D,Transações!A:A,\">=\"&'Graph Data'!$E$2,Transações!A:A,\"<=\"&'Graph Data'!$E$3,Transações!C:C,'Graph Data'!A3))","v":{"$error":"#N/A"}},"Janeiro","TÉRMINO",{"$f":"EOMONTH(E2,0)","v":"2022-02-28"},"Entrou",{"$f":"SUMIFS(Transações!E:E,Transações!A:A,\">=\"&'Graph Data'!$E$2,Transações!A:A,\"<=\"&'Graph Data'!$E$3,Transações!B:B,\"Entrada\")","v":2500},{"$f":"IF(_xlfn._xlws.SORT(_xlfn.UNIQUE(Transações!G2:G1048576))=0,\"\",_xlfn._xlws.SORT(_xlfn.UNIQUE(Transações!G2:G1048576)))","v":2021},"Chart Data",{"$f":"Resumo!G2","v":2022},"Janeiro","Fevereiro","Março","Abril","Maio","Junho","Julho","Agosto","Setembro","Outubro","Novembro","Dezembro"]
["Aluguel",{"$f":"IF(SUMIFS(Transações!D:D,Transações!A:A,\">=\"&'Graph Data'!$E$2,Transações!A:A,\"<=\"&'Graph Data'!$E$3,Transações!C:C,'Graph Data'!A4)=0,NA(),SUMIFS(Transações!D:D,Transações!A:A,\">=\"&'Graph Data'!$E$2,Transações!A:A,\"<=\"&'Graph Data'!$E$3,Transações!C:C,'Graph Data'!A4))","v":1150.5},"Fevereiro",null,null,"Saiu",{"$f":"SUMIFS(Transações!D:D,Transações!A:A,\">=\"&'Graph Data'!$E$2,Transações!A:A,\"<=\"&'Graph Data'!$E$3,Transações!B:B,\"Saída\")","v":1600.5},2022,null,"Entrou",{"$f":"SUMIFS(Transações!$E$2:$E$1048576,Transações!$A$2:$A$1048576,\">=\"&K1,Transações!$A$2:$A$1048576,\"<=\"&K2,Transações!$B$2:$B$1048576,\"Entrada\")","v":12000},{"$f":"SUMIFS(Transações!$E$2:$E$1048576,Transações!$A$2:$A$1048576,\">=\"&L1,Transações!$A$2:$A$1048576,\"<=\"&L2,Transações!$B$2:$B$1048576,\"Entrada\")","v":2500},{"$f":"SUMIFS(Transações!$E$2:$E$1048576,Transações!$A$2:$A$1048576,\">=\"&M1,Transações!$A$2:$A$1048576,\"<=\"&M2,Transações!$B$2:$B$1048576,\"Entrada\")","v":0},{"$f":"SUMIFS(Transações!$E$2:$E$1048576,Transações!$A$2:$A$1048576,\">=\"&N1,Transações!$A$2:$A$1048576,\"<=\"&N2,Transações!$B$2:$B$1048576,\"Entrada\")","v":1000},{"$f":"SUMIFS(Transações!$E$2:$E$1048576,Transações!$A$2:$A$1048576,\">=\"&O1,Transações!$A$2:$A$1048576,\"<=\"&O2,Transações!$B$2:$B$1048576,\"Entrada\")","v":0},{"$f":"SUMIFS(Transações!$E$2:$E$1048576,Transações!$A$2:$A$1048576,\">=\"&P1,Transações!$A$2:$A$1048576,\"<=\"&P2,Transações!$B$2:$B$1048576,\"Entrada\")","v":0},{"$f":"SUMIFS(Transações!$E$2:$E$1048576,Transações!$A$2:$A$1048576,\">=\"&Q1,Transações!$A$2:$A$1048576,\"<=\"&Q2,Transações!$B$2:$B$1048576,\"Entrada\")","v":0},{"$f":"SUMIFS(Transações!$E$2:$E$1048576,Transações!$A$2:$A$1048576,\">=\"&R1,Transações!$A$2:$A$1048576,\"<=\"&R2,Transações!$B$2:$B$1048576,\"Entrada\")","v":0},{"$f":"SUMIFS(Transações!$E$2:$E$1048576,Transações!$A$2:$A$1048576,\">=\"&S1,Transações!$A$2:$A$1048576,\"<=\"&S2,Transações!$B$2:$B$1048576,\"Entrada\")","v":0},{"$f":"SUMIFS(Transações!$E$2:$E$1048576,Transações!$A$2:$A$1048576,\">=\"&T1,Transações!$A$2:$A$1048576,\"<=\"&T2,Transações!$B$2:$B$1048576,\"Entrada\")","v":0},{"$f":"SUMIFS(Transações!$E$2:$E$1048576,Transações!$A$2:$A$1048576,\">=\"&U1,Transações!$A$2:$A$1048576,\"<=\"&U2,Transações!$B$2:$B$1048576,\"Entrada\")","v":0},{"$f":"SUMIFS(Transações!$E$2:$E$1048576,Transações!$A$2:$A$1048576,\">=\"&V1,Transações!$A$2:$A$1048576,\"<=\"&V2,Transações!$B$2:$B$1048576,\"Entrada\")","v":0}]
["Salário",{"$f":"IF(SUMIFS(Transações!D:D,Transações!A:A,\">=\"&'Graph Data'!$E$2,Transações!A:A,\"<=\"&'Graph Data'!$E$3,Transações!C:C,'Graph Data'!A5)=0,NA(),SUMIFS(Transações!D:D,Transações!A:A,\">=\"&'Graph Data'!$E$2,Transações!A:A,\"<=\"&'Graph Data'!$E$3,Transações!C:C,'Graph Data'!A5))","v":{"$error":"#N/A"}},"Março ",null,null,"Sobrou",{"$f":"G3-G4","v":899.5},"",null,"Saiu",{"$f":"SUMIFS(Transações!$D$2:$D$1048576,Transações!$A$2:$A$1048576,\">=\"&K1,Transações!$A$2:$A$1048576,\"<=\"&K2,Transações!$B$2:$B$1048576,\"Saída\")","v":6750.75},{"$f":"SUMIFS(Transações!$D$2:$D$1048576,Transações!$A$2:$A$1048576,\">=\"&L1,Transações!$A$2:$A$1048576,\"<=\"&L2,Transações!$B$2:$B$1048576,\"Saída\")","v":1600.5},{"$f":"SUMIFS(Transações!$D$2:$D$1048576,Transações!$A$2:$A$1048576,\">=\"&M1,Transações!$A$2:$A$1048576,\"<=\"&M2,Transações!$B$2:$B$1048576,\"Saída\")","v":0},{"$f":"SUMIFS(Transações!$D$2:$D$1048576,Transações!$A$2:$A$1048576,\">=\"&N1,Transações!$A$2:$A$1048576,\"<=\"&N2,Transações!$B$2:$B$1048576,\"Saída\")","v":200},{"$f":"SUMIFS(Transações!$D$2:$D$1048576,Transações!$A$2:$A$1048576,\">=\"&O1,Transações!$A$2:$A$1048576,\"<=\"&O2,Transações!$B$2:$B$1048576,\"Saída\")","v":0},{"$f":"SUMIFS(Transações!$D$2:$D$1048576,Transações!$A$2:$A$1048576,\">=\"&P1,Transações!$A$2:$A$1048576,\"<=\"&P2,Transações!$B$2:$B$1048576,\"Saída\")","v":0},{"$f":"SUMIFS(Transações!$D$2:$D$1048576,Transações!$A$2:$A$1048576,\">=\"&Q1,Transações!$A$2:$A$1048576,\"<=\"&Q2,Transações!$B$2:$B$1048576,\"Saída\")","v":0},{"$f":"SUMIFS(Transações!$D$2:$D$1048576,Transações!$A$2:$A$1048576,\">=\"&R1,Transações!$A$2:$A$1048576,\"<=\"&R2,Transações!$B$2:$B$1048576,\"Saída\")","v":0},{"$f":"SUMIFS(Transações!$D$2:$D$1048576,Transações!$A$2:$A$1048576,\">=\"&S1,Transações!$A$2:$A$1048576,\"<=\"&S2,Transações!$B$2:$B$1048576,\"Saída\")","v":0},{"$f":"SUMIFS(Transações!$D$2:$D$1048576,Transações!$A$2:$A$1048576,\">=\"&T1,Transações!$A$2:$A$1048576,\"<=\"&T2,Transações!$B$2:$B$1048576,\"Saída\")","v":0},{"$f":"SUMIFS(Transações!$D$2:$D$1048576,Transações!$A$2:$A$1048576,\">=\"&U1,Transações!$A$2:$A$1048576,\"<=\"&U2,Transações!$B$2:$B$1048576,\"Saída\")","v":0},{"$f":"SUMIFS(Transações!$D$2:$D$1048576,Transações!$A$2:$A$1048576,\">=\"&V1,Transações!$A$2:$A$1048576,\"<=\"&V2,Transações!$B$2:$B$1048576,\"Saída\")","v":0}]
["Viagem",{"$f":"IF(SUMIFS(Transações!D:D,Transações!A:A,\">=\"&'Graph Data'!$E$2,Transações!A:A,\"<=\"&'Graph Data'!$E$3,Transações!C:C,'Graph Data'!A6)=0,NA(),SUMIFS(Transações!D:D,Transações!A:A,\">=\"&'Graph Data'!$E$2,Transações!A:A,\"<=\"&'Graph Data'!$E$3,Transações!C:C,'Graph Data'!A6))","v":{"$error":"#N/A"}},"Abril",null,null,null,null,null,null,"Sobrou",{"$f":"K4-K5","v":5249.25},{"$f":"L4-L5","v":899.5},{"$f":"M4-M5","v":0},800,0,0,0,0,0,0,0,0]
["Lazer",{"$f":"IF(SUMIFS(Transações!D:D,Transações!A:A,\">=\"&'Graph Data'!$E$2,Transações!A:A,\"<=\"&'Graph Data'!$E$3,Transações!C:C,'Graph Data'!A7)=0,NA(),SUMIFS(Transações!D:D,Transações!A:A,\">=\"&'Graph Data'!$E$2,Transações!A:A,\"<=\"&'Graph Data'!$E$3,Transações!C:C,'Graph Data'!A7))","v":{"$error":"#N/A"}},"Maio"]
["Transporte",{"$f":"IF(SUMIFS(Transações!D:D,Transações!A:A,\">=\"&'Graph Data'!$E$2,Transações!A:A,\"<=\"&'Graph Data'!$E$3,Transações!C:C,'Graph Data'!A8)=0,NA(),SUMIFS(Transações!D:D,Transações!A:A,\">=\"&'Graph Data'!$E$2,Transações!A:A,\"<=\"&'Graph Data'!$E$3,Transações!C:C,'Graph Data'!A8))","v":450},"Junho"]
[null,{"$f":"IF(SUMIFS(Transações!D:D,Transações!A:A,\">=\"&'Graph Data'!$E$2,Transações!A:A,\"<=\"&'Graph Data'!$E$3,Transações!C:C,'Graph Data'!A9)=0,NA(),SUMIFS(Transações!D:D,Transações!A:A,\">=\"&'Graph Data'!$E$2,Transações!A:A,\"<=\"&'Graph Data'!$E$3,Transações!C:C,'Graph Data'!A9))","v":{"$error":"#N/A"}},"Julho"]
[null,{"$f":"IF(SUMIFS(Transações!D:D,Transações!A:A,\">=\"&'Graph Data'!$E$2,Transações!A:A,\"<=\"&'Graph Data'!$E$3,Transações!C:C,'Graph Data'!A10)=0,NA(),SUMIFS(Transações!D:D,Transações!A:A,\">=\"&'Graph Data'!$E$2,Transações!A:A,\"<=\"&'Graph Data'!$E$3,Transações!C:C,'Graph Data'!A10))","v":{"$error":"#N/A"}},"Agosto"]
[null,{"$f":"IF(SUMIFS(Transações!D:D,Transações!A:A,\">=\"&'Graph Data'!$E$2,Transações!A:A,\"<=\"&'Graph Data'!$E$3,Transações!C:C,'Graph Data'!A11)=0,NA(),SUMIFS(Transações!D:D,Transações!A:A,\">=\"&'Graph Data'!$E$2,Transações!A:A,\"<=\"&'Graph Data'!$E$3,Transações!C:C,'Graph Data'!A11))","v":{"$error":"#N/A"}},"Setembro"]
[null,{"$f":"IF(SUMIFS(Transações!D:D,Transações!A:A,\">=\"&'Graph Data'!$E$2,Transações!A:A,\"<=\"&'Graph Data'!$E$3,Transações!C:C,'Graph Data'!A12)=0,NA(),SUMIFS(Transações!D:D,Transações!A:A,\">=\"&'Graph Data'!$E$2,Transações!A:A,\"<=\"&'Graph Data'!$E$3,Transações!C:C,'Graph Data'!A12))","v":{"$error":"#N/A"}},"Outubro"]
[null,{"$f":"IF(SUMIFS(Transações!D:D,Transações!A:A,\">=\"&'Graph Data'!$E$2,Transações!A:A,\"<=\"&'Graph Data'!$E$3,Transações!C:C,'Graph Data'!A13)=0,NA(),SUMIFS(Transações!D:D,Transações!A:A,\">=\"&'Graph Data'!$E$2,Transações!A:A,\"<=\"&'Graph Data'!$E$3,Transações!C:C,'Graph Data'!A13))","v":{"$error":"#N/A"}},"Novembro"]
[null,{"$f":"IF(SUMIFS(Transações!D:D,Transações!A:A,\">=\"&'Graph Data'!$E$2,Transações!A:A,\"<=\"&'Graph Data'!$E$3,Transações!C:C,'Graph Data'!A14)=0,NA(),SUMIFS(Transações!D:D,Transações!A:A,\">=\"&'Graph Data'!$E$2,Transações!A:A,\"<=\"&'Graph Data'!$E$3,Transações!C:C,'Graph Data'!A14))","v":{"$error":"#N/A"}},"Dezembro"]
[null,{"$f":"IF(SUMIFS(Transações!D:D,Transações!A:A,\">=\"&'Graph Data'!$E$2,Transações!A:A,\"<=\"&'Graph Data'!$E$3,Transações!C:C,'Graph Data'!A15)=0,NA(),SUMIFS(Transações!D:D,Transações!A:A,\">=\"&'Graph Data'!$E$2,Transações!A:A,\"<=\"&'Graph Data'!$E$3,Transações!C:C,'Graph Data'!A15))","v":{"$error":"#N/A"}}]
[null,{"$f":"IF(SUMIFS(Transações!D:D,Transações!A:A,\">=\"&'Graph Data'!$E$2,Transações!A:A,\"<=\"&'Graph Data'!$E$3,Transações!C:C,'Graph Data'!A16)=0,NA(),SUMIFS(Transações!D:D,Transações!A:A,\">=\"&'Graph Data'!$E$2,Transações!A:A,\"<=\"&'Graph Data'!$E$3,Transações!C:C,'Graph Data'!A16))","v":{"$error":"#N/A"}}]
[null,{"$f":"IF(SUMIFS(Transações!D:D,Transações!A:A,\">=\"&'Graph Data'!$E$2,Transações!A:A,\"<=\"&'Graph Data'!$E$3,Transações!C:C,'Graph Data'!A17)=0,NA(),SUMIFS(Transações!D:D,Transações!A:A,\">=\"&'Graph Data'!$E$2,Transações!A:A,\"<=\"&'Graph Data'!$E$3,Transações!C:C,'Graph Data'!A17))","v":{"$error":"#N/A"}}]
[null,{"$f":"IF(SUMIFS(Transações!D:D,Transações!A:A,\">=\"&'Graph Data'!$E$2,Transações!A:A,\"<=\"&'Graph Data'!$E$3,Transações!C:C,'Graph Data'!A18)=0,NA(),SUMIFS(Transações!D:D,Transações!A:A,\">=\"&'Graph Data'!$E$2,Transações!A:A,\"<=\"&'Graph Data'!$E$3,Transações!C:C,'Graph Data'!A18))","v":{"$error":"#N/A"}}]
[null,{"$f":"IF(SUMIFS(Transações!D:D,Transações!A:A,\">=\"&'Graph Data'!$E$2,Transações!A:A,\"<=\"&'Graph Data'!$E$3,Transações!C:C,'Graph Data'!A19)=0,NA(),SUMIFS(Transações!D:D,Transações!A:A,\">=\"&'Graph Data'!$E$2,Transações!A:A,\"<=\"&'Graph Data'!$E$3,Transações!C:C,'Graph Data'!A19))","v":{"$error":"#N/A"}}]
[null,{"$f":"IF(SUMIFS(Transações!D:D,Transações!A:A,\">=\"&'Graph Data'!$E$2,Transações!A:A,\"<=\"&'Graph Data'!$E$3,Transações!C:C,'Graph Data'!A20)=0,NA(),SUMIFS(Transações!D:D,Transações!A:A,\">=\"&'Graph Data'!$E$2,Transações!A:A,\"<=\"&'Graph Data'!$E$3,Transações!C:C,'Graph Data'!A20))","v":{"$error":"#N/A"}}]
[null,{"$f":"IF(SUMIFS(Transações!D:D,Transações!A:A,\">=\"&'Graph Data'!$E$2,Transações!A:A,\"<=\"&'Graph Data'!$E$3,Transações!C:C,'Graph Data'!A21)=0,NA(),SUMIFS(Transações!D:D,Transações!A:A,\">=\"&'Graph Data'!$E$2,Transações!A:A,\"<=\"&'Graph Data'!$E$3,Transações!C:C,'Graph Data'!A21))","v":{"$error":"#N/A"}}]
[null,{"$f":"IF(SUMIFS(Transações!D:D,Transações!A:A,\">=\"&'Graph Data'!$E$2,Transações!A:A,\"<=\"&'Graph Data'!$E$3,Transações!C:C,'Graph Data'!A22)=0,NA(),SUMIFS(Transações!D:D,Transações!A:A,\">=\"&'Graph Data'!$E$2,Transações!A:A,\"<=\"&'Graph Data'!$E$3,Transações!C:C,'Graph Data'!A22))","v":{"$error":"#N/A"}}]
[null,{"$f":"IF(SUMIFS(Transações!D:D,Transações!A:A,\">=\"&'Graph Data'!$E$2,Transações!A:A,\"<=\"&'Graph Data'!$E$3,Transações!C:C,'Graph Data'!A23)=0,NA(),SUMIFS(Transações!D:D,Transações!A:A,\">=\"&'Graph Data'!$E$2,Transações!A:A,\"<=\"&'Graph Data'!$E$3,Transações!C:C,'Graph Data'!A23))","v":{"$error":"#N/A"}}]
[null,{"$f":"IF(SUMIFS(Transações!D:D,Transações!A:A,\">=\"&'Graph Data'!$E$2,Transações!A:A,\"<=\"&'Graph Data'!$E$3,Transações!C:C,'Graph Data'!A24)=0,NA(),SUMIFS(Transações!D:D,Transações!A:A,\">=\"&'Graph Data'!$E$2,Transações!A:A,\"<=\"&'Graph Data'!$E$3,Transações!C:C,'Graph Data'!A24))","v":{"$error":"#N/A"}}]
[null,{"$f":"IF(SUMIFS(Transações!D:D,Transações!A:A,\">=\"&'Graph Data'!$E$2,Transações!A:A,\"<=\"&'Graph Data'!$E$3,Transações!C:C,'Graph Data'!A25)=0,NA(),SUMIFS(Transações!D:D,Transações!A:A,\">=\"&'Graph Data'!$E$2,Transações!A:A,\"<=\"&'Graph Data'!$E$3,Transações!C:C,'Graph Data'!A25))","v":{"$error":"#N/A"}}]
[null,{"$f":"IF(SUMIFS(Transações!D:D,Transações!A:A,\">=\"&'Graph Data'!$E$2,Transações!A:A,\"<=\"&'Graph Data'!$E$3,Transações!C:C,'Graph Data'!A26)=0,NA(),SUMIFS(Transações!D:D,Transações!A:A,\">=\"&'Graph Data'!$E$2,Transações!A:A,\"<=\"&'Graph Data'!$E$3,Transações!C:C,'Graph Data'!A26))","v":{"$error":"#N/A"}}]
[null,{"$f":"IF(SUMIFS(Transações!D:D,Transações!A:A,\">=\"&'Graph Data'!$E$2,Transações!A:A,\"<=\"&'Graph Data'!$E$3,Transações!C:C,'Graph Data'!A27)=0,NA(),SUMIFS(Transações!D:D,Transações!A:A,\">=\"&'Graph Data'!$E$2,Transações!A:A,\"<=\"&'Graph Data'!$E$3,Transações!C:C,'Graph Data'!A27))","v":{"$error":"#N/A"}}]
[null,{"$f":"IF(SUMIFS(Transações!D:D,Transações!A:A,\">=\"&'Graph Data'!$E$2,Transações!A:A,\"<=\"&'Graph Data'!$E$3,Transações!C:C,'Graph Data'!A28)=0,NA(),SUMIFS(Transações!D:D,Transações!A:A,\">=\"&'Graph Data'!$E$2,Transações!A:A,\"<=\"&'Graph Data'!$E$3,Transações!C:C,'Graph Data'!A28))","v":{"$error":"#N/A"}}]
[null,{"$f":"IF(SUMIFS(Transações!D:D,Transações!A:A,\">=\"&'Graph Data'!$E$2,Transações!A:A,\"<=\"&'Graph Data'!$E$3,Transações!C:C,'Graph Data'!A29)=0,NA(),SUMIFS(Transações!D:D,Transações!A:A,\">=\"&'Graph Data'!$E$2,Transações!A:A,\"<=\"&'Graph Data'!$E$3,Transações!C:C,'Graph Data'!A29))","v":{"$error":"#N/A"}}]
[null,{"$f":"IF(SUMIFS(Transações!D:D,Transações!A:A,\">=\"&'Graph Data'!$E$2,Transações!A:A,\"<=\"&'Graph Data'!$E$3,Transações!C:C,'Graph Data'!A30)=0,NA(),SUMIFS(Transações!D:D,Transações!A:A,\">=\"&'Graph Data'!$E$2,Transações!A:A,\"<=\"&'Graph Data'!$E$3,Transações!C:C,'Graph Data'!A30))","v":{"$error":"#N/A"}}]
[null,{"$f":"IF(SUMIFS(Transações!D:D,Transações!A:A,\">=\"&'Graph Data'!$E$2,Transações!A:A,\"<=\"&'Graph Data'!$E$3,Transações!C:C,'Graph Data'!A31)=0,NA(),SUMIFS(Transações!D:D,Transações!A:A,\">=\"&'Graph Data'!$E$2,Transações!A:A,\"<=\"&'Graph Data'!$E$3,Transações!C:C,'Graph Data'!A31))","v":{"$error":"#N/A"}}]
[null,{"$f":"IF(SUMIFS(Transações!D:D,Transações!A:A,\">=\"&'Graph Data'!$E$2,Transações!A:A,\"<=\"&'Graph Data'!$E$3,Transações!C:C,'Graph Data'!A32)=0,NA(),SUMIFS(Transações!D:D,Transações!A:A,\">=\"&'Graph Data'!$E$2,Transações!A:A,\"<=\"&'Graph Data'!$E$3,Transações!C:C,'Graph Data'!A32))","v":{"$error":"#N/A"}}]
[null,{"$f":"IF(SUMIFS(Transações!D:D,Transações!A:A,\">=\"&'Graph Data'!$E$2,Transações!A:A,\"<=\"&'Graph Data'!$E$3,Transações!C:C,'Graph Data'!A33)=0,NA(),SUMIFS(Transações!D:D,Transações!A:A,\">=\"&'Graph Data'!$E$2,Transações!A:A,\"<=\"&'Graph Data'!$E$3,Transações!C:C,'Graph Data'!A33))","v":{"$error":"#N/A"}}]
[null,{"$f":"IF(SUMIFS(Transações!D:D,Transações!A:A,\">=\"&'Graph Data'!$E$2,Transações!A:A,\"<=\"&'Graph Data'!$E$3,Transações!C:C,'Graph Data'!A34)=0,NA(),SUMIFS(Transações!D:D,Transações!A:A,\">=\"&'Graph Data'!$E$2,Transações!A:A,\"<=\"&'Graph Data'!$E$3,Transações!C:C,'Graph Data'!A34))","v":{"$error":"#N/A"}}]
[null,{"$f":"IF(SUMIFS(Transações!D:D,Transações!A:A,\">=\"&'Graph Data'!$E$2,Transações!A:A,\"<=\"&'Graph Data'!$E$3,Transações!C:C,'Graph Data'!A35)=0,NA(),SUMIFS(Transações!D:D,Transações!A:A,\">=\"&'Graph Data'!$E$2,Transações!A:A,\"<=\"&'Graph Data'!$E$3,Transações!C:C,'Graph Data'!A35))","v":{"$error":"#N/A"}}]
[null,{"$f":"IF(SUMIFS(Transações!D:D,Transações!A:A,\">=\"&'Graph Data'!$E$2,Transações!A:A,\"<=\"&'Graph Data'!$E$3,Transações!C:C,'Graph Data'!A36)=0,NA(),SUMIFS(Transações!D:D,Transações!A:A,\">=\"&'Graph Data'!$E$2,Transações!A:A,\"<=\"&'Graph Data'!$E$3,Transações!C:C,'Graph Data'!A36))","v":{"$error":"#N/A"}}]
[null,{"$f":"IF(SUMIFS(Transações!D:D,Transações!A:A,\">=\"&'Graph Data'!$E$2,Transações!A:A,\"<=\"&'Graph Data'!$E$3,Transações!C:C,'Graph Data'!A37)=0,NA(),SUMIFS(Transações!D:D,Transações!A:A,\">=\"&'Graph Data'!$E$2,Transações!A:A,\"<=\"&'Graph Data'!$E$3,Transações!C:C,'Graph Data'!A37))","v":{"$error":"#N/A"}}]
[null,{"$f":"IF(SUMIFS(Transações!D:D,Transações!A:A,\">=\"&'Graph Data'!$E$2,Transações!A:A,\"<=\"&'Graph Data'!$E$3,Transações!C:C,'Graph Data'!A38)=0,NA(),SUMIFS(Transações!D:D,Transações!A:A,\">=\"&'Graph Data'!$E$2,Transações!A:A,\"<=\"&'Graph Data'!$E$3,Transações!C:C,'Graph Data'!A38))","v":{"$error":"#N/A"}}]
[null,{"$f":"IF(SUMIFS(Transações!D:D,Transações!A:A,\">=\"&'Graph Data'!$E$2,Transações!A:A,\"<=\"&'Graph Data'!$E$3,Transações!C:C,'Graph Data'!A39)=0,NA(),SUMIFS(Transações!D:D,Transações!A:A,\">=\"&'Graph Data'!$E$2,Transações!A:A,\"<=\"&'Graph Data'!$E$3,Transações!C:C,'Graph Data'!A39))","v":{"$error":"#N/A"}}]
[null,{"$f":"IF(SUMIFS(Transações!D:D,Transações!A:A,\">=\"&'Graph Data'!$E$2,Transações!A:A,\"<=\"&'Graph Data'!$E$3,Transações!C:C,'Graph Data'!A40)=0,NA(),SUMIFS(Transações!D:D,Transações!A:A,\">=\"&'Graph Data'!$E$2,Transações!A:A,\"<=\"&'Graph Data'!$E$3,Transações!C:C,'Graph Data'!A40))","v":{"$error":"#N/A"}}]
{"$rows_left_out":961}
{"sheet":"Tags","index":3,"n_rows":7,"n_cols":1,"rows_kept":7,"cut":false,"hidden":true,"merged":[]}
["Tags"]
["Mercado"]
["Aluguel"]
["Salário"]
["Viagem"]
["Lazer"]
["Transporte"]

{"sheet":"Transações","index":4,"n_rows":12,"n_cols":7,"rows_kept":12,"cut":false,"hidden":false,"merged":[]}
["Data","Tipo","Transação","Saída","Entrada","Observações","Ano"]
["2022-01-12","Entrada","Aluguel",null,12000,null,2022]
["2022-01-22","Saída","Viagem",6500.25,null,null,2022]
["2022-01-30","Saída","Transporte",250.5,null,null,2022]
["2022-02-02","Saída","Transporte",200,null,null,2022]
["2022-02-05","Entrada","Salário",null,2500,null,2022]
["2022-02-10","Saída","Aluguel",1000,null,null,2022]
["2022-02-10","Saída","Transporte",250,null,null,2022]
["2022-02-12","Saída","Aluguel",150.5,null,null,2022]
["2022-04-14","Saída","Aluguel",200,null,null,2022]
["2021-04-26","Entrada","Salário",null,1000,null,2021]
["2022-04-12","Entrada","Salário",null,1000,null,2022]